{"text_format":"3","workbook":"xlsx","n_sheets":8,"sheets":["Beschreibung","MULTIGRIP","BÜGELGRIFF","GRIFFLEISTE","MONOGRIP","CONTROLGRIP2","CONTROLGRIP3","Daten"],"not_rendered":{"images":12,"defined_names":6},"read":"whole","date_system":"1900"}

{"sheet":"Beschreibung","index":0,"n_rows":10,"n_cols":6,"rows_kept":10,"merged":[[2,5,2,14],[3,5,3,14],[4,5,4,14],[5,5,5,14],[6,5,6,14],[7,5,7,14]]}
[{"$nulls":4},"                         Bestellcode-Konfigurator"]
[{"$nulls":4},"Anleitung:"]
[{"$nulls":4},"Schritt 1","Gewünschte Bauform in den Tabellenblättern auswählen"]
[{"$nulls":4},"Schritt 2","Allgemeine Felder ausfüllen"]
[{"$nulls":4},"Schritt 3","Konfiguration in der Dropdown Liste auswählen (Bestellcode wird automatisch generiert)"]
[{"$nulls":4},"Schritt 4","Optionale Tasterbeschriftung hinzufügen (Tasterbeschriftungen nur auf Anfrage)"]
[{"$nulls":4},"Schritt 5","Sollen mehrere verschiede Griffe angefragt werden, muss der automatisch erstellte Bestellcode in die unteren Zeilen (\"Weitere Konfigurationen\") kopiert werden."]
[{"$nulls":4},"Schritt 6","PDF drucken und an info@pasmag.de mit dem Betreff: Datum im Format JJJJMMTT-Ihr Firmenname-Persönlicher Zusatz senden\n"]
[]
[{"$nulls":4},"Beispiel\nBetreff:","20210208-PASMAG-Musterprojekt"]

{"sheet":"MULTIGRIP","index":1,"n_rows":54,"n_cols":18,"rows_kept":54,"merged":[[0,10,2,19],[6,15,6,17],[7,12,7,13],[7,16,7,17],[8,12,8,13],[9,12,9,13],[9,16,9,17],[10,12,10,13],[11,12,11,13],[12,12,12,13],[13,12,13,13],[13,15,13,16],[14,15,14,16],[15,15,15,16],[16,15,16,16],[42,12,42,13],[46,11,51,18]]}
[]
[]
[]
[]
[{"$nulls":11},"Anfrage vom:",{"$f":"TODAY()","v":"2021-02-12"}]
[]
[{"$nulls":11},"Ihre Firmenanschrift/Rechnungsanschrift:",{"$nulls":3},"Ihre Anfrage:"]
[{"$nulls":11},"Ansprechpartner","XXXXXX",null,null,"Anzahl",1]
[{"$nulls":11},"Firma","XXXXXX",null,null,"Bestellnummer",{"$f":"M43","v":"000017-0-0-0-0-0-0"}]
[{"$nulls":11},"PLZ","XXXXXX",null,null,"Gew. Liefertermin"]
[{"$nulls":11},"Ort","XXXXXX"]
[{"$nulls":11},"Straße","XXXXXX",null,null,"Weitere Konfigurationen"]
[{"$nulls":11},"Telefonnummer","XXXXXX",null,null,"Bestellnummer",null,"Anzahl"]
[{"$nulls":11},"E-Mail","XXXXXX",null,null,"XXX",null,"X"]
[{"$nulls":15},"XXX",null,"X"]
[{"$nulls":15},"XXX",null,"X"]
[{"$nulls":15},"XXX",null,"X"]
{"$rows_empty":15}
[{"$nulls":11},"000017","MULTIGRIP"]
[]
[{"$nulls":11},"Taste","Tasterfunktion","Farbe",null,"Beschriftung"]
[{"$nulls":11},1,"Ohne",{"$f":"IF(M36=\"Ohne\",\"\",\"Blau\")","v":""},null,"Taste","Text","Verbauseite"]
[{"$nulls":11},2,"Ohne",{"$f":"IF(M37=\"Ohne\",\"\",\"Blau\")","v":""},null,1,null,"Rechts"]
[{"$nulls":11},3,"Ohne","",null,2]
[{"$nulls":11},4,"Ohne","",null,3]
[{"$nulls":11},5,"Ohne","",null,4]
[{"$nulls":11},6,"Ohne",{"$f":"IF(M41=\"Ohne\",\"\",\"Rot\")","v":""},null,5]
[{"$nulls":15},6]
[{"$nulls":11},"Bestellcode:",{"$f":"L33&\"-\"&Daten!I7&Daten!J7&\"-\"&Daten!I8&Daten!J8&\"-\"&Daten!I9&Daten!J9&\"-\"&Daten!I10&Daten!J10&\"-\"&Daten!I11&Daten!J11&\"-\"&Daten!I12&Daten!J12","v":"000017-0-0-0-0-0-0"},null,null,"(Die Beschriftung wird vor der Bestellung von uns geprüft)"]
[]
[]
[{"$nulls":11},"Bemerkung:"]
{"$rows_empty":7}
[{"$nulls":17},"Dokumentenstand 02/2020"]

{"sheet":"BÜGELGRIFF","index":2,"n_rows":55,"n_cols":18,"rows_kept":55,"merged":[[0,10,2,19],[6,15,6,17],[7,12,7,13],[7,16,7,17],[8,12,8,13],[9,12,9,13],[9,16,9,17],[10,12,10,13],[11,12,11,13],[12,12,12,13],[13,12,13,13],[13,15,13,16],[14,15,14,16],[15,15,15,16],[48,12,48,13],[51,11,52,18]]}
[]
[]
[]
[]
[{"$nulls":11},"Anfrage vom:",{"$f":"TODAY()","v":"2021-02-12"}]
[]
[{"$nulls":11},"Ihre Firmenanschrift/Rechnungsanschrift:",{"$nulls":3},"Ihre Anfrage:"]
[{"$nulls":11},"Ansprechpartner","XXXXXX",null,null,"Anzahl",1]
[{"$nulls":11},"Firma","XXXXXX",null,null,"Bestellnummer",{"$f":"M49","v":"000032-1B-1B-0"}]
[{"$nulls":11},"PLZ","XXXXXX",null,null,"Gew. Liefertermin"]
[{"$nulls":11},"Ort","XXXXXX"]
[{"$nulls":11},"Straße","XXXXXX",null,null,"Weitere Konfigurationen"]
[{"$nulls":11},"Telefonnummer","XXXXXX",null,null,"Bestellnummer",null,"Anzahl"]
[{"$nulls":11},"E-Mail","XXXXXX",null,null,"XXX",null,"X"]
[{"$nulls":15},"XXX",null,"X"]
[{"$nulls":15},"XXX",null,"X"]
[{"$nulls":15},"XXX",null,"X"]
{"$rows_empty":21}
[{"$nulls":11},{"$f":"IF(M40=2,\"000032\",IF(M40=3,\"000033\",\"x\"))","v":"000032"},"BUEGELGRIFF"]
[{"$nulls":11},"Anzahl der Taster",2]
[{"$nulls":11},"Taste","Tasterfunktion","Farbe",null,"Beschriftung"]
[{"$nulls":11},1,"Tastend","Blau",null,"Taste","Text","Verbauseite"]
[{"$nulls":11},2,"Tastend",{"$f":"IF(M43=\"Ohne\",\"\",\"Blau\")","v":"Blau"},null,1,null,"Rechts"]
[{"$nulls":11},3,"Ohne",{"$f":"IF(M44=\"Ohne\",\"\",\"Blau\")","v":""},null,2]
[{"$nulls":15},3]
[]
[]
[]
[{"$nulls":11},"Bestellcode:",{"$f":"L39&\"-\"&Daten!L7&Daten!M7&\"-\"&Daten!L8&Daten!M8&\"-\"&Daten!L9&Daten!M9","v":"000032-1B-1B-0"},null,null,"(Die Beschriftung wird vor der Bestellung von uns geprüft)"]
[]
[{"$nulls":11},"Bemerkung:"]
[]
[]
[]
[{"$nulls":17},"Dokumentenstand 09/2020"]

{"sheet":"GRIFFLEISTE","index":3,"n_rows":53,"n_cols":18,"rows_kept":53,"merged":[[0,10,2,19],[6,15,6,17],[7,12,7,13],[7,16,7,17],[8,12,8,13],[9,12,9,13],[9,16,9,17],[10,12,10,13],[11,12,11,13],[12,12,12,13],[13,12,13,13],[13,15,13,16],[14,15,14,16],[15,15,15,16],[16,15,16,16],[41,12,41,13],[45,11,50,18]]}
[]
[]
[]
[]
[{"$nulls":11},"Anfrage vom:",{"$f":"TODAY()","v":"2021-02-12"}]
[]
[{"$nulls":11},"Ihre Firmenanschrift/Rechnungsanschrift:",{"$nulls":3},"Ihre Anfrage:"]
[{"$nulls":11},"Ansprechpartner","XXXXXX",null,null,"Anzahl",1]
[{"$nulls":11},"Firma","XXXXXX",null,null,"Bestellnummer",{"$f":"M42","v":"000041--------"}]
[{"$nulls":11},"PLZ","XXXXXX",null,null,"Gew. Liefertermin"]
[{"$nulls":11},"Ort","XXXXXX"]
[{"$nulls":11},"Straße","XXXXXX",null,null,"Weitere Konfigurationen"]
[{"$nulls":11},"Telefonnummer","XXXXXX",null,null,"Bestellnummer",null,"Anzahl"]
[{"$nulls":11},"E-Mail","XXXXXX",null,null,"XXX",null,"X"]
[{"$nulls":15},"XXX",null,"X"]
[{"$nulls":15},"XXX",null,"X"]
[{"$nulls":15},"XXX",null,"X"]
{"$rows_empty":15}
[{"$nulls":11},{"$f":"IF(M34=1,\"000041\",IF(M34=2,\"000042\",IF(M34=3,\"000043\",IF(M34=4,\"000044\",IF(M34=5,\"000045\",IF(M34=6,\"000046\",IF(M34=7,\"000047\",IF(M34=8,\"000048\",\"x\"))))))))","v":"000041"},"GRIFFLEISTE"]
[{"$nulls":11},"Anzahl der Taster",1,null,null,"Beschriftung"]
[{"$nulls":11},"Taste","Tasterfunktion","Farbe",null,"Taste","Text","Verbauseite"]
[{"$nulls":11},1,"Ohne",{"$f":"IF(M36=\"Ohne\",\"\",\"Blau\")","v":""},null,1,null,"Rechts"]
[{"$nulls":11},2,"Ohne",{"$f":"IF(M37=\"Ohne\",\"\",\"Blau\")","v":""},null,2]
[{"$nulls":11},4,"Ohne","",null,4]
[{"$nulls":11},6,"Ohne","",null,6]
[{"$nulls":11},8,"Ohne","",null,8]
[{"$nulls":15},"(Die Beschriftung wird vor der Bestellung von uns geprüft)"]
[{"$nulls":11},"Bestellcode:",{"$f":"L33&\"-\"&Daten!O7&Daten!P7&\"-\"&Daten!O8&Daten!P8&\"-\"&Daten!O9&Daten!P9&\"-\"&Daten!O10&Daten!P10&\"-\"&Daten!O11&Daten!P11&\"-\"&Daten!O12&Daten!P12&\"-\"&Daten!O13&Daten!P13&\"-\"&Daten!O14&Daten!P14","v":"000041--------"}]
[]
[]
[{"$nulls":11},"Bemerkung:"]
{"$rows_empty":7}
[{"$nulls":17},"Dokumentenstand 09/2020"]

{"sheet":"MONOGRIP","index":4,"n_rows":54,"n_cols":18,"rows_kept":54,"merged":[[0,10,2,19],[6,15,6,17],[7,12,7,13],[7,16,7,17],[8,12,8,13],[9,12,9,13],[9,16,9,17],[10,12,10,13],[11,12,11,13],[12,12,12,13],[13,12,13,13],[13,15,13,16],[14,15,14,16],[15,15,15,16],[42,12,42,13],[46,11,51,18]]}
[]
[]
[]
[]
[{"$nulls":11},"Anfrage vom:",{"$f":"TODAY()","v":"2021-02-12"}]
[]
[{"$nulls":11},"Ihre Firmenanschrift/Rechnungsanschrift:",{"$nulls":3},"Ihre Anfrage:"]
[{"$nulls":11},"Ansprechpartner","XXXXXX",null,null,"Anzahl",1]
[{"$nulls":11},"Firma","XXXXXX",null,null,"Bestellnummer",{"$f":"M43","v":"000060-1B-1B"}]
[{"$nulls":11},"PLZ","XXXXXX",null,null,"Gew. Liefertermin"]
[{"$nulls":11},"Ort","XXXXXX"]
[{"$nulls":11},"Straße","XXXXXX",null,null,"Weitere Konfigurationen"]
[{"$nulls":11},"Telefonnummer","XXXXXX",null,null,"Bestellnummer",null,"Anzahl"]
[{"$nulls":11},"E-Mail","XXXXXX",null,null,"XXX",null,"X"]
[{"$nulls":15},"XXX",null,"X"]
[{"$nulls":15},"XXX",null,"X"]
[{"$nulls":15},"XXX",null,"X"]
{"$rows_empty":15}
[{"$nulls":11},"000060","MONOGRIP"]
[]
[{"$nulls":11},"Taste","Tasterfunktion","Farbe",null,"Beschriftung"]
[{"$nulls":11},1,"Tastend",{"$f":"IF(M36=\"Ohne\",\"\",\"Blau\")","v":"Blau"},null,"Taste","Text","Verbauseite"]
[{"$nulls":11},2,"Tastend",{"$f":"IF(M37=\"Ohne\",\"\",\"Blau\")","v":"Blau"},null,1,null,"Rechts"]
[{"$nulls":15},2]
[]
[]
[]
[]
[{"$nulls":11},"Bestellcode:",{"$f":"L33&\"-\"&Daten!I23&Daten!J23&\"-\"&Daten!I24&Daten!J24","v":"000060-1B-1B"},null,null,"(Die Beschriftung wird vor der Bestellung von uns geprüft)"]
[]
[]
[{"$nulls":11},"Bemerkung:"]
{"$rows_empty":7}
[{"$nulls":17},"Dokumentenstand 02/2020"]

{"sheet":"CONTROLGRIP2","index":5,"n_rows":57,"n_cols":18,"rows_kept":57,"merged":[[0,10,2,19],[6,15,6,17],[7,12,7,13],[7,16,7,17],[8,12,8,13],[9,12,9,13],[9,16,9,17],[10,12,10,13],[11,12,11,13],[12,12,12,13],[13,12,13,13],[13,15,13,16],[14,15,14,16],[15,15,15,16],[16,15,16,16],[48,12,48,13],[52,11,54,18]]}
[]
[]
[]
[]
[{"$nulls":11},"Anfrage vom:",{"$f":"TODAY()","v":"2021-02-12"}]
[]
[{"$nulls":11},"Ihre Firmenanschrift/Rechnungsanschrift:",{"$nulls":3},"Ihre Anfrage:"]
[{"$nulls":11},"Ansprechpartner","XXXXXX",null,null,"Anzahl",1]
[{"$nulls":11},"Firma","XXXXXX",null,null,"Bestellnummer",{"$f":"M49","v":"000084-0-0-0-0"}]
[{"$nulls":11},"PLZ","XXXXXX",null,null,"Gew. Liefertermin"]
[{"$nulls":11},"Ort","XXXXXX"]
[{"$nulls":11},"Straße","XXXXXX",null,null,"Weitere Konfigurationen"]
[{"$nulls":11},"Telefonnummer","XXXXXX",null,null,"Bestellnummer",null,"Anzahl"]
[{"$nulls":11},"E-Mail","XXXXXX",null,null,"XXX",null,"X"]
[{"$nulls":15},"XXX",null,"X"]
[{"$nulls":15},"XXX",null,"X"]
[{"$nulls":15},"XXX",null,"X"]
{"$rows_empty":21}
[{"$nulls":11},"000084","Controlgrip2"]
[]
[{"$nulls":11},"Taste","Tasterfunktion","Farbe",null,"Beschriftung"]
[{"$nulls":11},1,"Ohne",{"$f":"IF(M42=\"Ohne\",\"\",\"Blau\")","v":""},null,"Taste","Text","Verbauseite"]
[{"$nulls":11},2,"Ohne",{"$f":"IF(M43=\"Ohne\",\"\",\"Blau\")","v":""},null,1,null,"Rechts"]
[{"$nulls":11},3,"Ohne","",null,2]
[{"$nulls":11},4,"Ohne","",null,3]
[{"$nulls":15},4]
[]
[]
[{"$nulls":11},"Bestellcode:",{"$f":"L39&\"-\"&Daten!L24&Daten!M24&\"-\"&Daten!L25&Daten!M25&\"-\"&Daten!L26&Daten!M26&\"-\"&Daten!L27&Daten!M27&\"\"","v":"000084-0-0-0-0"},null,null,"(Die Beschriftung wird vor der Bestellung von uns geprüft)"]
[]
[]
[{"$nulls":11},"Bemerkung:"]
[]
[]
[]
[]
[{"$nulls":17},"Dokumentenstand 02/2021"]

{"sheet":"CONTROLGRIP3","index":6,"n_rows":57,"n_cols":18,"rows_kept":57,"merged":[[0,10,2,19],[6,15,6,17],[7,12,7,13],[7,16,7,17],[8,12,8,13],[9,12,9,13],[9,16,9,17],[10,12,10,13],[11,12,11,13],[12,12,12,13],[13,12,13,13],[13,15,13,16],[14,15,14,16],[15,15,15,16],[16,15,16,16],[48,12,48,13],[52,11,54,18]]}
[]
[]
[]
[]
[{"$nulls":11},"Anfrage vom:",{"$f":"TODAY()","v":"2021-02-12"}]
[]
[{"$nulls":11},"Ihre Firmenanschrift/Rechnungsanschrift:",{"$nulls":3},"Ihre Anfrage:"]
[{"$nulls":11},"Ansprechpartner","XXXXXX",null,null,"Anzahl",1]
[{"$nulls":11},"Firma","XXXXXX",null,null,"Bestellnummer",{"$f":"M49","v":"000085-0-0-0-0-0"}]
[{"$nulls":11},"PLZ","XXXXXX",null,null,"Gew. Liefertermin"]
[{"$nulls":11},"Ort","XXXXXX"]
[{"$nulls":11},"Straße","XXXXXX",null,null,"Weitere Konfigurationen"]
[{"$nulls":11},"Telefonnummer","XXXXXX",null,null,"Bestellnummer",null,"Anzahl"]
[{"$nulls":11},"E-Mail","XXXXXX",null,null,"XXX",null,"X"]
[{"$nulls":15},"XXX",null,"X"]
[{"$nulls":15},"XXX",null,"X"]
[{"$nulls":15},"XXX",null,"X"]
{"$rows_empty":21}
[{"$nulls":11},"000085","Controlgrip3"]
[]
[{"$nulls":11},"Taste","Tasterfunktion","Farbe",null,"Beschriftung"]
[{"$nulls":11},1,"Ohne",{"$f":"IF(M42=\"Ohne\",\"\",\"Blau\")","v":""},null,"Taste","Text","Verbauseite"]
[{"$nulls":11},2,"Ohne",{"$f":"IF(M43=\"Ohne\",\"\",\"Blau\")","v":""},null,1,null,"Rechts"]
[{"$nulls":11},3,"Ohne","",null,2]
[{"$nulls":11},4,"Ohne","",null,3]
[{"$nulls":11},5,"Ohne",{"$f":"IF(M46=\"Ohne\",\"\",\"Blau\")","v":""},null,4]
[{"$nulls":15},5]
[]
[{"$nulls":11},"Bestellcode:",{"$f":"L39&\"-\"&Daten!O24&Daten!P24&\"-\"&Daten!O25&Daten!P25&\"-\"&Daten!O26&Daten!P26&\"-\"&Daten!O27&Daten!P27&\"-\"&Daten!O28&Daten!P28&\"\"","v":"000085-0-0-0-0-0"},null,null,"(Die Beschriftung wird vor der Bestellung von uns geprüft)"]
[]
[]
[{"$nulls":11},"Bemerkung:"]
[]
[]
[]
[]
[{"$nulls":17},"Dokumentenstand 02/2021"]

{"sheet":"Daten","index":7,"n_rows":30,"n_cols":20,"rows_kept":30,"hidden":true}
[]
[]
[{"$nulls":8},"Multigripp:",null,null,"Bügelgriff",null,null,"Griffleiste",null,null,"Anzahl der Taster",null,"Anzahl der Taster Bügelgriff"]
["000017 Multigrip Tasterkonfiguration",{"$nulls":16},1,null,2]
["Taster 1-3","Taster 4-5","Taster 6","Farben",null,"Verbauseite",null,null,"Umschlüsselung auf Bestellcode",{"$nulls":8},2,null,3]
["Tastend","Tastend","Versenkt","Schwarz",null,"Rechts",{"$nulls":11},4]
["Rastend","Ohne","Pilztaster","Weiß",null,"Links",null,null,{"$f":"IF(MULTIGRIP!M36=\"Tastend\",\"1\",IF(MULTIGRIP!M36=\"Rastend\",\"2\",IF(MULTIGRIP!M36=\"Ohne\",\"0\",\"\")))","v":"0"},{"$f":"IF(MULTIGRIP!N36=\"Schwarz\",\"S\",IF(MULTIGRIP!N36=\"Weiß\",\"W\",IF(MULTIGRIP!N36=\"Rot\",\"R\",IF(MULTIGRIP!N36=\"Blau\",\"B\",IF(MULTIGRIP!N36=\"Ohne\",\"\",\"\")))))","v":""},null,{"$f":"IF(BÜGELGRIFF!M42=\"Tastend\",\"1\",IF(BÜGELGRIFF!M42=\"Rastend\",\"2\",IF(BÜGELGRIFF!M42=\"Ohne\",\"0\",\"\")))","v":"1"},{"$f":"IF(BÜGELGRIFF!N42=\"Schwarz\",\"S\",IF(BÜGELGRIFF!N42=\"Weiß\",\"W\",IF(BÜGELGRIFF!N42=\"Rot\",\"R\",IF(BÜGELGRIFF!N42=\"Blau\",\"B\",IF(BÜGELGRIFF!N42=\"Ohne\",\"\",\"\")))))","v":"B"},1,{"$f":"IF(GRIFFLEISTE!M36=\"Tastend\",\"1\",IF(GRIFFLEISTE!M36=\"Rastend\",\"2\",IF(GRIFFLEISTE!M36=\"Ohne\",\"\",\"\")))","v":""},{"$f":"IF(GRIFFLEISTE!N36=\"Schwarz\",\"S\",IF(GRIFFLEISTE!N36=\"Weiß\",\"W\",IF(GRIFFLEISTE!N36=\"Rot\",\"R\",IF(GRIFFLEISTE!N36=\"Blau\",\"B\",IF(GRIFFLEISTE!N36=\"Ohne\",\"\",\"\")))))","v":""},null,6]
["Ohne",null,"Ohne","Blau",{"$nulls":4},{"$f":"IF(MULTIGRIP!M37=\"Tastend\",\"1\",IF(MULTIGRIP!M37=\"Rastend\",\"2\",IF(MULTIGRIP!M37=\"Ohne\",\"0\",\"\")))","v":"0"},{"$f":"IF(MULTIGRIP!N37=\"Schwarz\",\"S\",IF(MULTIGRIP!N37=\"Weiß\",\"W\",IF(MULTIGRIP!N37=\"Rot\",\"R\",IF(MULTIGRIP!N37=\"Blau\",\"B\",IF(MULTIGRIP!N37=\"Ohne\",\"\",\"\")))))","v":""},null,{"$f":"IF(BÜGELGRIFF!M43=\"Tastend\",\"1\",IF(BÜGELGRIFF!M43=\"Rastend\",\"2\",IF(BÜGELGRIFF!M43=\"Ohne\",\"0\",\"\")))","v":"1"},{"$f":"IF(BÜGELGRIFF!N43=\"Schwarz\",\"S\",IF(BÜGELGRIFF!N43=\"Weiß\",\"W\",IF(BÜGELGRIFF!N43=\"Rot\",\"R\",IF(BÜGELGRIFF!N43=\"Blau\",\"B\",IF(BÜGELGRIFF!N43=\"Ohne\",\"\",\"\")))))","v":"B"},2,{"$f":"IF(GRIFFLEISTE!M37=\"Tastend\",\"1\",IF(GRIFFLEISTE!M37=\"Rastend\",\"2\",IF(GRIFFLEISTE!M37=\"Ohne\",\"\",\"\")))","v":""},{"$f":"IF(GRIFFLEISTE!N37=\"Schwarz\",\"S\",IF(GRIFFLEISTE!N37=\"Weiß\",\"W\",IF(GRIFFLEISTE!N37=\"Rot\",\"R\",IF(GRIFFLEISTE!N37=\"Blau\",\"B\",IF(GRIFFLEISTE!N37=\"Ohne\",\"\",\"\")))))","v":""},null,8]
[{"$nulls":3},"Rot",{"$nulls":4},{"$f":"IF(MULTIGRIP!M38=\"Tastend\",\"1\",IF(MULTIGRIP!M38=\"Rastend\",\"2\",IF(MULTIGRIP!M38=\"Ohne\",\"0\",\"\")))","v":"0"},{"$f":"IF(MULTIGRIP!N38=\"Schwarz\",\"S\",IF(MULTIGRIP!N38=\"Weiß\",\"W\",IF(MULTIGRIP!N38=\"Rot\",\"R\",IF(MULTIGRIP!N38=\"Blau\",\"B\",IF(MULTIGRIP!N38=\"Ohne\",\"\",\"\")))))","v":""},null,{"$f":"IF(BÜGELGRIFF!M44=\"Tastend\",\"1\",IF(BÜGELGRIFF!M44=\"Rastend\",\"2\",IF(BÜGELGRIFF!M44=\"Ohne\",\"0\",\"\")))","v":"0"},{"$f":"IF(BÜGELGRIFF!N44=\"Schwarz\",\"S\",IF(BÜGELGRIFF!N44=\"Weiß\",\"W\",IF(BÜGELGRIFF!N44=\"Rot\",\"R\",IF(BÜGELGRIFF!N44=\"Blau\",\"B\",IF(BÜGELGRIFF!N44=\"Ohne\",\"\",\"\")))))","v":""},4,{"$f":"IF(GRIFFLEISTE!M38=\"Tastend\",\"1\",IF(GRIFFLEISTE!M38=\"Rastend\",\"2\",IF(GRIFFLEISTE!M38=\"Ohne\",\"\",\"\")))","v":""},{"$f":"IF(GRIFFLEISTE!N38=\"Schwarz\",\"S\",IF(GRIFFLEISTE!N38=\"Weiß\",\"W\",IF(GRIFFLEISTE!N38=\"Rot\",\"R\",IF(GRIFFLEISTE!N38=\"Blau\",\"B\",IF(GRIFFLEISTE!N38=\"Ohne\",\"\",\"\")))))","v":""}]
[{"$nulls":8},{"$f":"IF(MULTIGRIP!M39=\"Tastend\",\"1\",IF(MULTIGRIP!M39=\"Rastend\",\"2\",IF(MULTIGRIP!M39=\"Ohne\",\"0\",\"\")))","v":"0"},{"$f":"IF(MULTIGRIP!N39=\"Schwarz\",\"S\",IF(MULTIGRIP!N39=\"Weiß\",\"W\",IF(MULTIGRIP!N39=\"Rot\",\"R\",IF(MULTIGRIP!N39=\"Blau\",\"B\",IF(MULTIGRIP!N39=\"Ohne\",\"\",\"\")))))","v":""},null,{"$f":"IF(MULTIGRIP!P39=\"Tastend\",\"1\",IF(MULTIGRIP!P39=\"Rastend\",\"2\",IF(MULTIGRIP!P39=\"Ohne\",\"0\",\"\")))","v":""},{"$f":"IF(MULTIGRIP!Q39=\"Schwarz\",\"S\",IF(MULTIGRIP!Q39=\"Weiß\",\"W\",IF(MULTIGRIP!Q39=\"Rot\",\"R\",IF(MULTIGRIP!Q39=\"Blau\",\"B\",IF(MULTIGRIP!Q39=\"Ohne\",\"\",\"\")))))","v":""},6,{"$f":"IF(GRIFFLEISTE!M39=\"Tastend\",\"1\",IF(GRIFFLEISTE!M39=\"Rastend\",\"2\",IF(GRIFFLEISTE!M39=\"Ohne\",\"\",\"\")))","v":""},{"$f":"IF(GRIFFLEISTE!N39=\"Schwarz\",\"S\",IF(GRIFFLEISTE!N39=\"Weiß\",\"W\",IF(GRIFFLEISTE!N39=\"Rot\",\"R\",IF(GRIFFLEISTE!N39=\"Blau\",\"B\",IF(GRIFFLEISTE!N39=\"Ohne\",\"\",\"\")))))","v":""}]
[{"$nulls":8},{"$f":"IF(MULTIGRIP!M40=\"Tastend\",\"1\",IF(MULTIGRIP!M40=\"Rastend\",\"2\",IF(MULTIGRIP!M40=\"Ohne\",\"0\",\"\")))","v":"0"},{"$f":"IF(MULTIGRIP!N40=\"Schwarz\",\"S\",IF(MULTIGRIP!N40=\"Weiß\",\"W\",IF(MULTIGRIP!N40=\"Rot\",\"R\",IF(MULTIGRIP!N40=\"Blau\",\"B\",IF(MULTIGRIP!N40=\"Ohne\",\"\",\"\")))))","v":""},null,{"$f":"IF(MULTIGRIP!P40=\"Tastend\",\"1\",IF(MULTIGRIP!P40=\"Rastend\",\"2\",IF(MULTIGRIP!P40=\"Ohne\",\"0\",\"\")))","v":""},{"$f":"IF(MULTIGRIP!Q40=\"Schwarz\",\"S\",IF(MULTIGRIP!Q40=\"Weiß\",\"W\",IF(MULTIGRIP!Q40=\"Rot\",\"R\",IF(MULTIGRIP!Q40=\"Blau\",\"B\",IF(MULTIGRIP!Q40=\"Ohne\",\"\",\"\")))))","v":""},8,{"$f":"IF(GRIFFLEISTE!M40=\"Tastend\",\"1\",IF(GRIFFLEISTE!M40=\"Rastend\",\"2\",IF(GRIFFLEISTE!M40=\"Ohne\",\"\",\"\")))","v":""},{"$f":"IF(GRIFFLEISTE!N40=\"Schwarz\",\"S\",IF(GRIFFLEISTE!N40=\"Weiß\",\"W\",IF(GRIFFLEISTE!N40=\"Rot\",\"R\",IF(GRIFFLEISTE!N40=\"Blau\",\"B\",IF(GRIFFLEISTE!N40=\"Ohne\",\"\",\"\")))))","v":""}]
[{"$nulls":8},{"$f":"IF(MULTIGRIP!M41=\"Versenkt\",\"3\",IF(MULTIGRIP!M41=\"Pilztaster\",\"4\",IF(MULTIGRIP!M41=\"Ohne\",\"0\",\"\")))","v":"0"},{"$f":"IF(MULTIGRIP!N41=\"Schwarz\",\"S\",IF(MULTIGRIP!N41=\"Weiß\",\"W\",IF(MULTIGRIP!N41=\"Rot\",\"R\",IF(MULTIGRIP!N41=\"Blau\",\"B\",IF(MULTIGRIP!N41=\"Ohne\",\"\",\"\")))))","v":""},null,{"$f":"IF(MULTIGRIP!P41=\"Versenkt\",\"3\",IF(MULTIGRIP!P41=\"Pilztaster\",\"4\",IF(MULTIGRIP!P41=\"Ohne\",\"0\",\"\")))","v":""},{"$f":"IF(MULTIGRIP!Q41=\"Schwarz\",\"S\",IF(MULTIGRIP!Q41=\"Weiß\",\"W\",IF(MULTIGRIP!Q41=\"Rot\",\"R\",IF(MULTIGRIP!Q41=\"Blau\",\"B\",IF(MULTIGRIP!Q41=\"Ohne\",\"\",\"\")))))","v":""}]
[{"$nulls":8},{"$f":"IF(MULTIGRIP!M42=\"Tastend\",\"1\",IF(MULTIGRIP!M42=\"Rastend\",\"2\",IF(MULTIGRIP!M42=\"Ohne\",\"0\",\"\")))","v":""}]
[]
[]
[]
[]
[]
[]
[{"$nulls":8},"Monogrip",null,null,"Controlgrip2:",null,null,"Controlgrip2:"]
[]
[{"$nulls":11},"Umschlüsselung auf Bestellcode",null,null,"Umschlüsselung auf Bestellcode"]
[{"$nulls":8},{"$f":"IF(MONOGRIP!M36=\"Tastend\",\"1\",IF(MONOGRIP!M36=\"Rastend\",\"2\",IF(MONOGRIP!M36=\"Ohne\",\"0\",\"\")))","v":"1"},{"$f":"IF(MONOGRIP!N36=\"Schwarz\",\"S\",IF(MONOGRIP!N36=\"Weiß\",\"W\",IF(MONOGRIP!N36=\"Rot\",\"R\",IF(MONOGRIP!N36=\"Blau\",\"B\",IF(MONOGRIP!N36=\"Ohne\",\"\",\"\")))))","v":"B"}]
[{"$nulls":8},{"$f":"IF(MONOGRIP!M37=\"Tastend\",\"1\",IF(MONOGRIP!M37=\"Rastend\",\"2\",IF(MONOGRIP!M37=\"Ohne\",\"0\",\"\")))","v":"1"},{"$f":"IF(MONOGRIP!N37=\"Schwarz\",\"S\",IF(MONOGRIP!N37=\"Weiß\",\"W\",IF(MONOGRIP!N37=\"Rot\",\"R\",IF(MONOGRIP!N37=\"Blau\",\"B\",IF(MONOGRIP!N37=\"Ohne\",\"\",\"\")))))","v":"B"},null,{"$f":"IF(CONTROLGRIP2!M42=\"Tastend\",\"1\",IF(CONTROLGRIP2!M42=\"Rastend\",\"2\",IF(CONTROLGRIP2!M42=\"Ohne\",\"0\",\"\")))","v":"0"},{"$f":"IF(CONTROLGRIP2!N42=\"Rot\",\"R\",IF(CONTROLGRIP2!N42=\"Blau\",\"B\",IF(CONTROLGRIP2!N42=\"Ohne\",\"\",\"\")))","v":""},null,{"$f":"IF(CONTROLGRIP3!M42=\"Tastend\",\"1\",IF(CONTROLGRIP3!M42=\"Rastend\",\"2\",IF(CONTROLGRIP3!M42=\"Ohne\",\"0\",\"\")))","v":"0"},{"$f":"IF(CONTROLGRIP3!N42=\"Rot\",\"R\",IF(CONTROLGRIP3!N42=\"Blau\",\"B\",IF(CONTROLGRIP3!N42=\"Ohne\",\"\",\"\")))","v":""}]
[{"$nulls":11},{"$f":"IF(CONTROLGRIP2!M43=\"Tastend\",\"1\",IF(CONTROLGRIP2!M43=\"Rastend\",\"2\",IF(CONTROLGRIP2!M43=\"Ohne\",\"0\",\"\")))","v":"0"},{"$f":"IF(CONTROLGRIP2!N43=\"Rot\",\"R\",IF(CONTROLGRIP2!N43=\"Blau\",\"B\",IF(CONTROLGRIP2!N43=\"Ohne\",\"\",\"\")))","v":""},null,{"$f":"IF(CONTROLGRIP3!M43=\"Tastend\",\"1\",IF(CONTROLGRIP3!M43=\"Rastend\",\"2\",IF(CONTROLGRIP3!M43=\"Ohne\",\"0\",\"\")))","v":"0"},{"$f":"IF(CONTROLGRIP3!N43=\"Rot\",\"R\",IF(CONTROLGRIP3!N43=\"Blau\",\"B\",IF(CONTROLGRIP3!N43=\"Ohne\",\"\",\"\")))","v":""}]
[{"$nulls":11},{"$f":"IF(CONTROLGRIP2!M44=\"Tastend\",\"1\",IF(CONTROLGRIP2!M44=\"Rastend\",\"2\",IF(CONTROLGRIP2!M44=\"Ohne\",\"0\",\"\")))","v":"0"},{"$f":"IF(CONTROLGRIP2!N44=\"Rot\",\"R\",IF(CONTROLGRIP2!N44=\"Blau\",\"B\",IF(CONTROLGRIP2!N44=\"Ohne\",\"\",\"\")))","v":""},null,{"$f":"IF(CONTROLGRIP3!M44=\"Tastend\",\"1\",IF(CONTROLGRIP3!M44=\"Rastend\",\"2\",IF(CONTROLGRIP3!M44=\"Ohne\",\"0\",\"\")))","v":"0"},{"$f":"IF(CONTROLGRIP3!N44=\"Rot\",\"R\",IF(CONTROLGRIP3!N44=\"Blau\",\"B\",IF(CONTROLGRIP3!N44=\"Ohne\",\"\",\"\")))","v":""}]
[{"$nulls":11},{"$f":"IF(CONTROLGRIP2!M45=\"Tastend\",\"1\",IF(CONTROLGRIP2!M45=\"Rastend\",\"2\",IF(CONTROLGRIP2!M45=\"Ohne\",\"0\",\"\")))","v":"0"},{"$f":"IF(CONTROLGRIP2!N45=\"Rot\",\"R\",IF(CONTROLGRIP2!N45=\"Blau\",\"B\",IF(CONTROLGRIP2!N45=\"Ohne\",\"\",\"\")))","v":""},null,{"$f":"IF(CONTROLGRIP3!M45=\"Tastend\",\"1\",IF(CONTROLGRIP3!M45=\"Rastend\",\"2\",IF(CONTROLGRIP3!M45=\"Ohne\",\"0\",\"\")))","v":"0"},{"$f":"IF(CONTROLGRIP3!N45=\"Rot\",\"R\",IF(CONTROLGRIP3!N45=\"Blau\",\"B\",IF(CONTROLGRIP3!N45=\"Ohne\",\"\",\"\")))","v":""}]
[{"$nulls":11},{"$f":"IF(MULTIGRIP!P57=\"Tastend\",\"1\",IF(MULTIGRIP!P57=\"Rastend\",\"2\",IF(MULTIGRIP!P57=\"Ohne\",\"0\",\"\")))","v":""},{"$f":"IF(MULTIGRIP!Q57=\"Schwarz\",\"S\",IF(MULTIGRIP!Q57=\"Weiß\",\"W\",IF(MULTIGRIP!Q57=\"Rot\",\"R\",IF(MULTIGRIP!Q57=\"Blau\",\"B\",IF(MULTIGRIP!Q57=\"Ohne\",\"\",\"\")))))","v":""},null,{"$f":"IF(CONTROLGRIP3!M46=\"Tastend\",\"1\",IF(CONTROLGRIP3!M46=\"Rastend\",\"2\",IF(CONTROLGRIP3!M46=\"Ohne\",\"0\",\"\")))","v":"0"},{"$f":"IF(CONTROLGRIP3!N46=\"Rot\",\"R\",IF(CONTROLGRIP3!N46=\"Blau\",\"B\",IF(CONTROLGRIP3!N46=\"Ohne\",\"\",\"\")))","v":""}]
[{"$nulls":11},{"$f":"IF(MULTIGRIP!P58=\"Versenkt\",\"3\",IF(MULTIGRIP!P58=\"Pilztaster\",\"4\",IF(MULTIGRIP!P58=\"Ohne\",\"0\",\"\")))","v":""},{"$f":"IF(MULTIGRIP!Q58=\"Schwarz\",\"S\",IF(MULTIGRIP!Q58=\"Weiß\",\"W\",IF(MULTIGRIP!Q58=\"Rot\",\"R\",IF(MULTIGRIP!Q58=\"Blau\",\"B\",IF(MULTIGRIP!Q58=\"Ohne\",\"\",\"\")))))","v":""},null,{"$f":"IF(MULTIGRIP!S58=\"Versenkt\",\"3\",IF(MULTIGRIP!S58=\"Pilztaster\",\"4\",IF(MULTIGRIP!S58=\"Ohne\",\"0\",\"\")))","v":""},{"$f":"IF(MULTIGRIP!T58=\"Schwarz\",\"S\",IF(MULTIGRIP!T58=\"Weiß\",\"W\",IF(MULTIGRIP!T58=\"Rot\",\"R\",IF(MULTIGRIP!T58=\"Blau\",\"B\",IF(MULTIGRIP!T58=\"Ohne\",\"\",\"\")))))","v":""}]
[{"$nulls":11},{"$f":"IF(MULTIGRIP!P59=\"Tastend\",\"1\",IF(MULTIGRIP!P59=\"Rastend\",\"2\",IF(MULTIGRIP!P59=\"Ohne\",\"0\",\"\")))","v":""},null,null,{"$f":"IF(MULTIGRIP!S59=\"Tastend\",\"1\",IF(MULTIGRIP!S59=\"Rastend\",\"2\",IF(MULTIGRIP!S59=\"Ohne\",\"0\",\"\")))","v":""}]